(semantics by type)
type: ThesaurusArray
type: Collection
narrower: Generative semantics
preferred label: (semantikk etter type) @nn

Generative semantics
type: Topic
type: Concept
ccmapper candidates: 11
ccmapper state: accepted
created: 2000-03-22T00:00:00
modified: 2025-07-25T14:26:21
broad match: e23
broader: (semantics by type)
definition: Retning innen transformasjonell generativ grammatikk på 60- og 70-tallet, som forkastet tanken om en syntaktisk djupstruktur <UBO> @nb
in scheme: Humord
mapping relation: e23
preferred label: Generativ semantikk @nn

Humord
type: ConceptScheme

Topic
type: Class
label: Innholdsbeskrivende emne @nb