Innholdsbeskrivende emne
type: Class
label: Topic @en

Humord
type: ConceptScheme

(verb etter type)
type: ThesaurusArray
type: Collection
narrower: Weak verbs
preferred label: (verb by type) @en

Weak verbs
type: Concept
type: Innholdsbeskrivende emne
ccmapper candidates: 11
ccmapper state: accepted
created: 2009-10-22T00:00:00
modified: 2025-07-23T07:11:03
alternative label: Linne verb
broad match: e23
broader: (verb etter type)
definition: Svake verb eller linne verb er ei gruppe verb som i germanske språk markerer tidskifte med ei bøygningsendring. <wikipedia>
in scheme: Humord
mapping relation: e23
preferred label: Svake verb