Innholdsbeskrivende emne
type: Class
label: Topic @en

Humord
type: ConceptScheme

(personer etter yrke)
type: ThesaurusArray
type: Collection
narrower: Amtmenn
preferred label: (personar etter yrke) @nn
preferred label: (persons by profession) @en

Amtmenn
type: Innholdsbeskrivende emne
type: Concept
ccmapper candidates: 10
ccmapper state: accepted
created: 2009-10-22T00:00:00
modified: 2024-08-14T09:19:39
broad match: e23
broader: (personer etter yrke)
definition: Amtmenn var fyrstens representant i et amt, administrativ region. Eldre betegnelse brukt i Danmark, Norge og Tyskland <UBB>
in scheme: Humord
mapping relation: e23
preferred label: Distric governors @en