Innholdsbeskrivende emne
type: Class
label: Topic @en

Humord
type: ConceptScheme

(film etter type)
type: ThesaurusArray
type: Collection
narrower: Historiske filmer
preferred label: (movies by type) @en

Historiske filmer
type: Concept
type: Innholdsbeskrivende emne
ccmapper candidates: 1
ccmapper state: accepted
created: 2011-11-01T00:00:00
modified: 2025-12-09T15:07:50
alternative label: Historical films @en
alternative label: Historisk film
broader: (film etter type)
definition: Filmsjanger som tar utgangpunkt i autentiske historiske hendelser. Filmer som har en fiktiv handling i en historisk kontekst kalles også for historiske filmer <Wikipedia>
editorial note: Lukket bemerkning: ubo11
in scheme: Humord
mapping relation: e23
preferred label: Historical film @en
preferred label: Historiske filmar @nn