(arkitektur etter materiale)
type: ThesaurusArray
type: Collection
narrower: Steinarkitektur
preferred label: (architecture by material) @en

Humord
type: ConceptScheme

Steinarkitektur
type: Innholdsbeskrivende emne
type: Concept
ccmapper candidates: 2
ccmapper state: accepted
created: 2015-01-02T00:00:00
modified: 2025-05-09T10:58:58
broader: (arkitektur etter materiale)
definition: Steinarkitektur er en arkitektonisk stil som kjennetegnes av bruk av stein som hovedmateriale. Denne stilen har vært brukt i mange forskjellige kulturer og epoker, og er kjent for sin skjønnhet og varighet <ordlista.no>
editorial note: Lukket bemerkning: ubo15
in scheme: Humord
mapping relation: e23
preferred label: Stone architecture @en
related match: e23

Innholdsbeskrivende emne
type: Class
label: Topic @en