Innholdsbeskrivende emne
type: Class
label: Topic @en

Humord
type: ConceptScheme

Religiøs kompleksitet
type: Innholdsbeskrivende emne
type: Concept
ccmapper candidates: 1
ccmapper state: accepted
created: 2017-12-19T00:00:00
modified: 2025-09-18T09:03:16
broad match: e23
broader: (sosiologi etter type)
definition: Refererer til sameksistensen av religiøs tilbakegang og vekst på makro, meso og individuelt nivå, og de ulike former for religiøse trosretninger på hvert nivå <UBO>
editorial note: Lukket bemerkning: ubo17
in scheme: Humord
mapping relation: e23
preferred label: Religious complexity @en

(sosiologi etter type)
type: ThesaurusArray
type: Collection
narrower: Religiøs kompleksitet
preferred label: (sociology by type) @en