New simplicity
type: Concept
type: Innholdsbeskrivende emne
created: 2020-05-07T00:00:00
modified: 2025-09-01T10:28:10
broader: (lyrikk etter type)
definition: Lyrikk som nedtoner symbolikk og som fokuserer på den konkrete virkeligheten. Typisk for 1960-tallsmodernismen <UBO>
editorial note: Lukket bemerkning: ubo20
in scheme: Humord
preferred label: Nyenkel lyrikk

Humord
type: ConceptScheme

(lyrikk etter type)
type: ThesaurusArray
type: Collection
narrower: New simplicity
preferred label: (poetry by type) @en

Innholdsbeskrivende emne
type: Class
label: Topic @en