(kunst etter retning, stil, synsvinkel)
type: ThesaurusArray
type: Collection
narrower: Structuralism
preferred label: (art by direction, style, angle) @en

Humord
type: ConceptScheme

Innholdsbeskrivende emne
type: Class
label: Topic @en

Structuralism
type: Innholdsbeskrivende emne
type: Concept
created: 2022-01-25T00:00:00
modified: 2025-05-07T15:01:59
broader: (kunst etter retning, stil, synsvinkel)
definition: I arkitekturen er strukturalismen bruk av moduler, det vil si enheter som blir satt sammen etter et på forhånd fastlagt mønster eller struktur. <SNL>
editorial note: Lukket bemerkning: Nasjonalmuseet22
in scheme: Humord
preferred label: Strukturalisme