(kunst etter retning, stil, synsvinkel)
type: ThesaurusArray
type: Collection
narrower: Vorticism
preferred label: (art by direction, style, angle) @en

Humord
type: ConceptScheme

Vorticism
type: Concept
type: Innholdsbeskrivende emne
created: 2022-01-25T00:00:00
modified: 2025-05-30T14:39:56
alternative label: Vorticisme
broader: (kunst etter retning, stil, synsvinkel)
definition: Vorticisme er en britisk kunstretning. Den var en parallell til den franske kubisme og den ett år eldre italienske futurisme <SNL>
editorial note: Lukket bemerkning: Nasjonalmuseet22
in scheme: Humord
preferred label: Vorticismen

Innholdsbeskrivende emne
type: Class
label: Topic @en