Bærekraftig arkitektur
type: Concept
type: Innholdsbeskrivende emne
ccmapper candidates: 1
ccmapper state: accepted
created: 2022-10-18T00:00:00
modified: 2025-05-09T09:51:11
alternative label: Sirkulær arkitektur
broader: (arkitektur etter type)
definition: Bærekraftig arkitektur er arkitektur som søker å minimere den negative miljøpåvirkningen av bygninger gjennom forbedret effektivitet og moderasjon i bruk av materialer, energi, utviklingsareal og økosystemet for øvrig. Noen ganger vil bærekraftig arkitektur også fokusere på det sosiale aspektet ved bærekraft <Bærekraftig arkitektur er arkitektur som søker å minimere den negative miljøpåvirkningen av bygninger gjennom forbedret effektivitet og moderasjon i bruk av materialer, energi, utviklingsareal og økosystemet for øvrig. Noen ganger vil bærekraftig arkitektur også fokusere på det sosiale aspektet ved bærekraft.<wikipedia>
editorial note: Lukket bemerkning: Nasjonalmuseet22
in scheme: Humord
mapping relation: e23
preferred label: Berekraftig arkitektur @nn
preferred label: Sustainable architecture @en

(arkitektur etter type)
type: ThesaurusArray
type: Collection
narrower: Bærekraftig arkitektur
preferred label: (architecture by type) @en

Humord
type: ConceptScheme

Innholdsbeskrivende emne
type: Class
label: Topic @en