Statsrådssaken
type: Concept
type: Innholdsbeskrivende emne
ccmapper candidates: 1
ccmapper state: accepted
created: 2022-11-23T00:00:00
modified: 2024-12-16T12:55:43
alternative label: Statsraadssag question @en
preferred label: Statsrådsaka
alternative label: Statsrad affair @en
alternative label: Statsrådsaken
broad match: e23
broader: (historie etter politiske hendelser)
definition: Statsrådssaken var en politisk konflikt i Norge om hvorvidt statsrådene skulle ha adgang til Stortinget. Striden begynte for alvor i slutten av 1860-årene og ble avsluttet i 1884 <SNL>
editorial note: Lukket bemerkning: ubo22
in scheme: Humord
mapping relation: e23
preferred label: Statsraad affair @en

Humord
type: ConceptScheme

(historie etter politiske hendelser)
type: ThesaurusArray
type: Collection
narrower: Statsrådssaken
preferred label: (historie etter politiske hendingar @nn
preferred label: (history by political events) @en

Innholdsbeskrivende emne
type: Class
label: Topic @en