Atomic bomb victims
type: Concept
type: Topic
ccmapper candidates: 1
ccmapper state: accepted
created: 2023-01-25T00:00:00
modified: 2024-11-05T19:28:19
alternative label: A-bomb victims
alternative label: Victims of atomic bombing
preferred label: Hibakusha
broad match: e23
broader: (persons by social, economical or physical features or characteristics)
definition: Hibakusha er et japansk ord som betyr «bombet mann». Ordet benyttes som en betegnelse på mennesker som opplevde og overlevde atombombene over Hiroshima og Nagasaki <Wikipedia> @nb
editorial note: Lukket bemerkning: ubo23 @nb
in scheme: Humord
mapping relation: e23

(persons by social, economical or physical features or characteristics)
type: ThesaurusArray
type: Collection
narrower: Atomic bomb victims
preferred label: (personar etter sosiale, økonomiske og fysiske særtrekk eller eigenskapar) @nn
preferred label: (personer etter sosiale, økonomiske og fysiske særtrekk eller egenskaper) @nb

Humord
type: ConceptScheme

Topic
type: Class
label: Innholdsbeskrivende emne @nb