Humord
type: ConceptScheme

(båter etter type)
type: ThesaurusArray
type: Collection
narrower: Lystbåter
preferred label: (båtar etter type) @nn
preferred label: (boats by type) @en

Lystbåter
type: Innholdsbeskrivende emne
type: Concept
created: 2023-03-03T00:00:00
modified: 2025-01-06T06:45:35
alternative label: Yachter
alternative label: Lystfartøy
alternative label: Yachtar @nn
alternative label: Yacht
broader: (båter etter type)
definition: Yacht er en engelsk betegnelse for lystfartøy, som kan være drevet med seil, dampmaskin eller motor. På norsk blir betegnelsen først og fremst brukt om større, luksuriøse motorlystfartøy <SNL>
editorial note: Lukket bemerkning: ubo23
in scheme: Humord
preferred label: Yachts @en
preferred label: Lystbåtar @nn

Innholdsbeskrivende emne
type: Class
label: Topic @en