Stedfortredere
type: Concept
type: Innholdsbeskrivende emne
ccmapper candidates: 1
ccmapper state: accepted
created: 2023-03-16T00:00:00
modified: 2024-11-04T12:36:50
alternative label: Deputies @en
alternative label: Proxies (Persons) @en
broad match: e23
broader: (personer etter sosiale, økonomiske og fysiske særtrekk eller egenskaper)
definition: Stedfortreder er en person overtar et arbeid, oppdrag eller stilling med fullmakt fra, eller som representant for, en annen person for en kortere tid i den andres fravær <Wikipedia>
editorial note: Lukket bemerkning: ubo23
in scheme: Humord
mapping relation: e23
preferred label: Substitutes @en
preferred label: Stadfortredar @nn

(personer etter sosiale, økonomiske og fysiske særtrekk eller egenskaper)
type: ThesaurusArray
type: Collection
narrower: Stedfortredere
preferred label: (personar etter sosiale, økonomiske og fysiske særtrekk eller eigenskapar) @nn
preferred label: (persons by social, economical or physical features or characteristics) @en

Humord
type: ConceptScheme

Innholdsbeskrivende emne
type: Class
label: Topic @en