Innholdsbeskrivende emne
type: Class
label: Topic @en

Humord
type: ConceptScheme

Kjeleflikkere
type: Innholdsbeskrivende emne
type: Concept
ccmapper candidates: 1
ccmapper state: accepted
created: 2023-08-15T00:00:00
modified: 2024-11-04T08:14:12
alternative label: Kjelepinkarar @nn
alternative label: Kjelepinkere
broad match: e23
broader: (personer etter yrke)
definition: En kjelepinker, eller kjeleflikker, var fra gammelt av en person som reiste rundt og drev med fortinning, eller tilverking av kobberartikler <Wikipedia>
editorial note: Lukket bemerkning: ubo23
in scheme: Humord
mapping relation: e23
preferred label: Kjeleflikkarar @nn
preferred label: Tinkers @en

(personer etter yrke)
type: ThesaurusArray
type: Collection
narrower: Kjeleflikkere
preferred label: (personar etter yrke) @nn
preferred label: (persons by profession) @en