Humord
type: ConceptScheme

Anarjokka
type: Concept
type: Geografisk
created: 2023-11-13T00:00:00
modified: 2025-03-24T08:54:46
alternative label: Anárjohka
preferred label: Anarjohka
alternative label: Anárjoga @se
broader: (elver i Norge)
definition: Anárjohka er ei elv i Karasjok og Kautokeino kommuner i Troms og Finnmark fylke. Anárjohka er kildeelv til Deatnu (Tanaelva) <SNL>>
editorial note: Lukket bemerkning: ubo23
in scheme: Humord

Geografisk
type: Class
label: Geographic @en

(elver i Norge)
type: ThesaurusArray
type: Collection
narrower: Anarjokka
preferred label: (elvar i Noreg) @nn
preferred label: (rivers in Norway) @en