Innholdsbeskrivende emne
type: Class
label: Topic @en

Humord
type: ConceptScheme

(historie etter konflikter)
type: ThesaurusArray
type: Collection
narrower: Grønlandssaken
preferred label: (historie etter konfliktar) @nn
preferred label: (history by conflicts) @en

Grønlandssaken
type: Innholdsbeskrivende emne
type: Concept
created: 2023-11-29T00:00:00
modified: 2024-12-11T11:23:09
alternative label: Eirik Raudes land
alternative label: Erik the Red's Land @en
broader: (historie etter konflikter)
definition: Grønlandssaken var en tvist mellom Norge og Danmark om suvereniteten over Grønland. Konflikten nådde sitt høydepunkt i 1931–1933 <SNL>
editorial note: Lukket bemerkning: ubo23
in scheme: Humord
preferred label: Grønlandssaka @nn
preferred label: Eastern Greenland Case @en