Innholdsbeskrivende emne
type: Class
label: Topic @en

Humord
type: ConceptScheme

(personer etter yrke)
type: ThesaurusArray
type: Collection
narrower: Influensere
preferred label: (personar etter yrke) @nn
preferred label: (persons by profession) @en

Influensere
type: Concept
type: Innholdsbeskrivende emne
created: 2023-12-08T00:00:00
modified: 2023-12-08T08:13:51
alternative label: Påvirkere
broader: (personer etter yrke)
definition: En influenser er en opinionsleder og brukes særlig om personer som ytrer seg offentlig i sosiale medier for å påvirke holdninger og handlinger hos sine følgere <SNL>
editorial note: Lukket bemerkning: ubo23
in scheme: Humord
preferred label: Influencers @en
preferred label: Influensarar @nn