Vegårvassdraget
type: Concept
type: Geografisk
created: 2023-12-18T00:00:00
modified: 2023-12-18T15:32:47
broader: (elver i Norge)
definition: Vegårvassdraget er et vassdrag som ligger i Agder og Vestfold og Telemark <wikipedia>
editorial note: Lukket bemerkning: ubo23
in scheme: Humord

Humord
type: ConceptScheme

Geografisk
type: Class
label: Geographic @en

(elver i Norge)
type: ThesaurusArray
type: Collection
narrower: Vegårvassdraget
preferred label: (elvar i Noreg) @nn
preferred label: (rivers in Norway) @en