Saltfjellet
type: Concept
type: Geografisk
created: 2024-01-03T00:00:00
modified: 2025-03-24T08:47:36
broader: (fjell i Norge)
definition: Saltfjellet er et fjellområde i Rana, Saltdal og Beiarn kommuner, Nordland, mellom Dunderlandsdalen i sør og Fylkesvei 812/Fylkesvei 813 mellom Saltdal og Beiarn i nord <SNL>
editorial note: Lukket bemerkning: ubo24
in scheme: Humord

(fjell i Norge)
type: ThesaurusArray
type: Collection
narrower: Saltfjellet
preferred label: (fjell i Noreg) @nn
preferred label: (mountains in Norway) @en

Humord
type: ConceptScheme

Geografisk
type: Class
label: Geographic @en