Innholdsbeskrivende emne
type: Class
label: Topic @en

Humord
type: ConceptScheme

1812 politics (Sweden)
type: Innholdsbeskrivende emne
type: Concept
created: 2024-01-18T00:00:00
modified: 2024-01-18T13:21:47
alternative label: 1812-års politikk (Sverige)
broader: (historie etter politiske hendelser)
definition: 1812 års politikk er vanlig betegnelse på den endring av Sveriges utenrikspolitikk som ble påbegynt i 1812 av daværende kronprins Karl Johan <wikipedia>
editorial note: Lukket bemerkning: ubo24
editorial note: Lukket bemerkning: norvok
in scheme: Humord
preferred label: 1812 års politikk (Sverige)

(historie etter politiske hendelser)
type: ThesaurusArray
type: Collection
narrower: 1812 politics (Sweden)
preferred label: (historie etter politiske hendingar @nn
preferred label: (history by political events) @en