Sylene
type: Geografisk
type: Concept
created: 2024-01-23T00:00:00
modified: 2025-03-24T08:49:45
alternative label: Sylane
preferred label: Sylan
alternative label: Bealjehk
broader: (fjell i Norge)
definition: Sylan er et fjellområde på grensen mellom Norge og Sverige, mellom dalførene Selbu/Tydal og Stjørdalen/Meråker i Trøndelag <SNL>
editorial note: Lukket bemerkning: ubo24
in scheme: Humord

(fjell i Norge)
type: ThesaurusArray
type: Collection
narrower: Sylene
preferred label: (fjell i Noreg) @nn
preferred label: (mountains in Norway) @en

Humord
type: ConceptScheme

Geografisk
type: Class
label: Geographic @en