Innholdsbeskrivende emne
type: Class
label: Topic @en

Humord
type: ConceptScheme

(økologi etter type)
type: ThesaurusArray
type: Collection
narrower: Anvendt økologi
preferred label: (ecology by type) @en

Anvendt økologi
type: Innholdsbeskrivende emne
type: Concept
created: 2024-02-06T00:00:00
modified: 2025-04-03T14:29:30
broader: (økologi etter type)
definition: Anvendt økologi er studiet om hvordan mennesket påvirker økosystemet, reduserer biologisk mangfold og truer fremtidige økosystemtjenester. <Wikipedia>
editorial note: Lukket bemerkning: ubo24
in scheme: Humord
preferred label: Applied ecology @en
preferred label: Bruksretta økologi @nn