Innholdsbeskrivende emne
type: Class
label: Topic @en

Humord
type: ConceptScheme

Atmosfærekjemi
type: Concept
type: Innholdsbeskrivende emne
created: 2024-02-13T00:00:00
modified: 2024-02-13T10:21:56
alternative label: Luftkjemi
alternative label: Atmosfærisk kjemi @nn
broader: (kjemi etter type)
definition: Atmosfærekjemi omfatter produksjon, transport, fordeling og kjemiske reaksjoner mellom stoffer i troposfæren og stratosfæren. <SNL>
editorial note: Lukket bemerkning: ubo24
in scheme: Humord
preferred label: Atmospheric chemistry @en

(kjemi etter type)
type: ThesaurusArray
type: Collection
narrower: Atmosfærekjemi
preferred label: (chemistry by type) @en