Innholdsbeskrivende emne
type: Class
label: Topic @en

Humord
type: ConceptScheme

Døveteater
type: Concept
type: Innholdsbeskrivende emne
created: 2024-02-21T00:00:00
modified: 2024-02-21T11:32:58
alternative label: Deaf theaters @en
broader: (teater etter form, funksjon, kontekst)
definition: Døveteater på norsk er en form for scenekunst som primært er utviklet og utført av døve og hørselshemmede personer. <uio>
editorial note: Lukket bemerkning: ubo24
editorial note: Lukket bemerkning: norvok
in scheme: Humord
preferred label: Deaf theatres @en

(teater etter form, funksjon, kontekst)
type: ThesaurusArray
type: Collection
narrower: Døveteater
preferred label: (theatre by form, function, context) @en