Innholdsbeskrivende emne
type: Class
label: Topic @en

Humord
type: ConceptScheme

(sport etter type)
type: ThesaurusArray
type: Collection
narrower: Parkour
preferred label: (sports by type) @en

Parkour
type: Innholdsbeskrivende emne
type: Concept
created: 2024-02-22T00:00:00
modified: 2024-02-22T07:17:41
alternative label: Parcour @en
broader: (sport etter type)
definition: Parkour er en aktivitet der utøverne bruker ulike teknikker, for eksempel klatring, løping, hopping og balansering, for å komme seg fra et punkt til et annet. Parkour omtales både som en aktivitet, bevegelse og livsstil. <SNL>
editorial note: Lukket bemerkning: NIH
editorial note: Lukket bemerkning: ubo24
in scheme: Humord