(kunst etter retning, stil, synsvinkel)
type: ThesaurusArray
type: Collection
narrower: Rinpa
preferred label: (art by direction, style, angle) @en

Humord
type: ConceptScheme

Rinpa
type: Innholdsbeskrivende emne
type: Concept
created: 2024-03-06T00:00:00
modified: 2025-04-04T15:21:54
alternative label: Rinpa school @en
alternative label: Rinpa-skolen
alternative label: Rimpa
broader: (kunst etter retning, stil, synsvinkel)
definition: Rinpa er en kunsthistorisk betegnelse på en teknikk eller måte å male, tegne eller kalligrafere på. Det er en betegnelse som oppstod i nyere tid, selv om denne teknikken/måten har eksistert lenger enn det. <Nasjonalmuseet>
editorial note: Lukket bemerkning: ubo24
in scheme: Humord

Innholdsbeskrivende emne
type: Class
label: Topic @en