(fjell i Norge)
type: ThesaurusArray
type: Collection
narrower: Kvamshesten
preferred label: (fjell i Noreg) @nn
preferred label: (mountains in Norway) @en

Humord
type: ConceptScheme

Kvamshesten
type: Concept
type: Geografisk
created: 2024-04-09T00:00:00
modified: 2024-04-10T09:33:49
alternative label: Storehesten
broader: (fjell i Norge)
definition: Kvamhesten er et fjell ved Bygstad i Sunnfjord kommune i Vestland fylke. Fjellet rager 1209 meter over havet. <SNL>
editorial note: Lukket bemerkning: ubo24
in scheme: Humord

Geografisk
type: Class
label: Geographic @en