Innholdsbeskrivende emne
type: Class
label: Topic @en

Humord
type: ConceptScheme

Prosjektledere
type: Innholdsbeskrivende emne
type: Concept
ccmapper candidates: 1
ccmapper state: accepted
created: 2024-07-03T00:00:00
modified: 2024-07-03T13:43:00
alternative label: Prosjektleiar @nn
alternative label: Prosjektleder
alternative label: Project leader @en
broader: (personer etter yrke)
definition: En prosjektleder har ansvar og myndighet til å lede prosjektet og levere de nødvendige produktene innenfor de rammer og begrensninger som er definert av prosjekteier.<openscience.no>
editorial note: Lukket bemerkning: ubo24
in scheme: Humord
mapping relation: e23
preferred label: Project leaders @en
preferred label: Prosjektleiarar @nn

(personer etter yrke)
type: ThesaurusArray
type: Collection
narrower: Prosjektledere
preferred label: (personar etter yrke) @nn
preferred label: (persons by profession) @en