Innholdsbeskrivende emne
type: Class
label: Topic @en

Humord
type: ConceptScheme

Alternativsamfunn
type: Innholdsbeskrivende emne
type: Concept
ccmapper candidates: 1
ccmapper state: accepted
created: 2025-01-21T00:00:00
modified: 2025-01-21T10:53:46
alternative label: Alternative samfunn
broader: (samfunn etter type)
definition: Alternativsamfunn er et samfunn eller en samfunnsgruppe som representerer et alternativ til det bestående og allment anerkjente. <SNL>
editorial note: Lukket bemerkning: nord25
in scheme: Humord
mapping relation: e23
preferred label: Alternative societies @en

(samfunn etter type)
type: ThesaurusArray
type: Collection
narrower: Alternativsamfunn
preferred label: (society by type) @en