Innholdsbeskrivende emne
type: Class
label: Topic @en

Humord
type: ConceptScheme

(historie etter politiske hendelser)
type: ThesaurusArray
type: Collection
narrower: Bodøsaken
preferred label: (historie etter politiske hendingar @nn
preferred label: (history by political events) @en

Bodøsaken
type: Concept
type: Innholdsbeskrivende emne
ccmapper candidates: 1
ccmapper state: accepted
created: 2025-03-06T00:00:00
modified: 2025-03-06T14:47:43
alternative label: Bodø controversy @en
broad match: e23
broader: (historie etter politiske hendelser)
definition: Bodøsaken var opprinnelig en smuglersak fra 1818, som utviklet seg til å bli en diplomatisk konflikt mellom Storbritannia og Sverige–Norge. <SNL>
editorial note: Lukket bemerkning: ubo25
in scheme: Humord
mapping relation: e23
preferred label: Bodø affair @en
preferred label: Bodøsaka @nn