Humord
type: ConceptScheme

Mandalselva
type: Concept
type: Geografisk
created: 2025-10-17T00:00:00
modified: 2025-10-17T12:41:30
alternative label: Marna
alternative label: Mandalsåni
broader: (elver i Norge)
definition: Mandalselva er en elv som renner i sørlig retning gjennom Mandalen i Agder fra Ørevatn (260 meter over havet, 4,2 kvadratkilometer) og med munning i Mandal tettsted. <SNL>
editorial note: Lukket bemerkning: ubo25
in scheme: Humord

Geografisk
type: Class
label: Geographic @en

(elver i Norge)
type: ThesaurusArray
type: Collection
narrower: Mandalselva
preferred label: (elvar i Noreg) @nn
preferred label: (rivers in Norway) @en