Innholdsbeskrivende emne
type: Class
label: Topic @en

Humord
type: ConceptScheme

(kunst etter funksjon, kontekst, opphav)
type: ThesaurusArray
type: Collection
narrower: Islamsk kunst
preferred label: (art by function, context, origin) @en

Islamsk kunst
type: Innholdsbeskrivende emne
type: Concept
ccmapper candidates: 1
ccmapper state: accepted
created: 2025-10-31T00:00:00
modified: 2025-10-31T13:45:57
broader: (kunst etter funksjon, kontekst, opphav)
definition: Den islamske kunsten er utbredt i land med innbyrdes svært ulik kulturbakgrunn. Til tross for dette er den ganske enhetlig. Det sammenbindende elementet er religionen, det vil si Muhammads lære, slik den er formulert i Koranen og hadith (tradisjon).<SNL>
editorial note: Var tidligere generell se-henvisning (31/10-25/vsl)
editorial note: Lukket bemerkning: nasjonalmuseet25
in scheme: Humord
mapping relation: e23
preferred label: Islamic art @en