Innholdsbeskrivende emne
type: Class
label: Topic @en

Realfagstermer
type: Dataset
type: Graph
type: ConceptScheme

Observational astronomy
type: Innholdsbeskrivende emne
type: Concept
created: 2022-06-23T00:00:00
modified: 2022-06-23T13:14:59
definition: Observasjonsastronomi er den grenen av astronomien som tilegnes observasjon av astronomiske objekter. (Wikipedia)
in scheme: Realfagstermer
preferred label: Observasjonsastronomi